{"text_format":"2","workbook":"xlsx","n_sheets":7,"sheets":["慧云3.0及3.1版本清单","Sheet1","final","东区","西区","南区","北区"],"not_rendered":{"charts":0,"images":0,"macros":0,"external_links":1,"defined_names":1,"comments":0,"pivot_tables":0},"unopened":[],"bounds":{"document_bytes":16777216,"sheet_cells":100000,"run_cost":"one","rows_first":2000,"rows_last":500,"rows_between":2000,"halvings":0,"cell_chars":16384,"cell_head_chars":4096},"cells_cut":0,"cells_raw":0,"read":"whole","date_system":"1900"}

{"sheet":"慧云3.0及3.1版本清单","index":0,"n_rows":188,"n_cols":15,"rows_kept":188,"cut":false,"hidden":false,"merged":[]}
["序号","能源系统项目id","慧云版本","项目名称","开业时间","所属城市名称","经度","纬度","所属大区","所属","气候分区","总面积","商管公区面积","百货公区面积","停车场面积"]
[1,4304080001,"3.0","衡阳蒸湘万达广场","2017.09.29","湖南省衡阳市",112.597894,26.88864,"南区","长沙","夏热冬冷",120149.1,91131," "]
[2,3505240001,"3.0","泉州安溪万达广场","2019.02.27","福建省泉州市",118.229196,25.076059,"南区","厦门","夏热冬暖",142011.4,74787.1," "]
[3,4309030001,"3.0","益阳赫山万达广场","2017.06.23","湖南省长沙市",112.379614,28.571233,"南区","长沙","夏热冬冷",131313.5,83046," "]
[4,4508020001,"3.0","贵港港北万达广场","2018.12.29","广西省南宁市",108.298197,22.874262,"南区","南宁","夏热冬暖",104069.3,81012.9," "]
[5,4505030001,"3.0","北海银海万达广场","2017.05.27","广西省北海市",109.150329,21.437483,"南区","南宁","夏热冬暖",108067.3,90513," "]
[6,4405110001,"3.0","汕头金平万达广场","2019.05.25","广东省汕头市",116.652573,23.384642,"南区","深圳","夏热冬暖",142071.7,98900," "]
[7,3601030001,"3.0","南昌西湖万达广场","2017.06.23","江西省南昌市",115.864326,28.638564,"南区","南昌","夏热冬冷",139907.3,100915," "]
[8,4211820001,"3.0","黄冈武穴万达广场","2019.12.31","湖北省黄冈市",115.58,29.85,"南区","武汉","夏热冬冷",104910.6,89500," "]
[9,4213030001,"3.0","随州万达广场","2019.11.15","湖北省随州市",113.41,31.69,"南区","武汉","夏热冬冷",124906.4,80210.4," "]
[10,3610020001,"3.0","抚州临川万达广场","2017.06.16","江西省抚州市",116.353068,27.962745,"南区","南昌","夏热冬冷",140154.5,90614," "]
[11,3601110001,"3.0","南昌青山湖万达广场","2018.12.21","江西省南昌市",115.96191,28.68194,"南区","南昌","夏热冬冷",118060,92700," "]
[12,3505030002,"3.0","泉州城东万达广场","2018.12.22","福建省泉州市",118.605866,24.888244,"南区","厦门","夏热冬暖",156940.4,89500," "]
[13,3604020001,"3.0","九江濂溪万达广场","2017.07.08","江西省九江市",116.021154,29.698556,"南区","南昌","夏热冬冷",130110.2,80052," "]
[14,4212020001,"3.0","咸宁咸安万达广场","2019.11.29","湖北省咸宁市",114.3,29.87,"南区","武汉","夏热冬冷",103766.9,85344," "]
[15,4413030001,"3.0","惠州大亚湾万达广场","2017.11.24","广东省惠州市",114.486968,22.761301,"南区","深圳","夏热冬暖",138700,99627," "]
[16,4407810001,"3.0","江门台山万达广场","2020.08.29","广东省江门市",112.820909,22.234528,"南区","广州","夏热冬暖",114254.9,79924.75," "]
[17,4501050001,"3.0","南宁江南万达广场","2017.06.23","广西省南宁市",108.319568,22.795787,"南区","南宁","夏热冬暖",135834.6,92677," "]
[18,4503120003,"3.0","桂林临桂万达广场","2020.09.30","广西省桂林市",110.196098,25.230569,"南区","南宁","夏热冬冷",129220.2,120218.1," "]
[19,4401050001,"3.0","广州海珠万达广场","2019.12.28","广东省广州市",113.32,23.08,"南区","广州","夏热冬暖",133841.7,68600," "]
[20,4401150001,"3.0","广州南沙万达广场","2015.12.22","广东省广州市",113.538907,22.801003,"南区","广州","夏热冬暖",164062,57600,20000]
[21,4312020001,"3.0","怀化鹤城万达广场","2019.12.21","湖南省怀化市",109.95,27.33,"南区","长沙","夏热冬冷",142081.4,81800," "]
[22,4418020001,"3.0","清远清城万达广场","2016.12.29","广东省清远市",113.019665,23.71962,"南区","广州","夏热冬暖",126600,91552," "]
[23,4509020001,"3.0","玉林玉州万达广场","2019.05.25","广西省玉林市",110.17923,22.635788,"南区","南宁","夏热冬暖",110949.1,92090," "]
[24,4409040001,"3.0","茂名电白万达广场","2019.12.19","广东省茂名市",110.88,21.68,"南区","广州","夏热冬暖",134442.7,79836," "]
[25,4401120003,"3.0","广州南岗万达广场","2020.09.30","广东省广州市",113.556991,23.10529,"南区","广州","夏热冬暖",135700,84163.22," "]
[26,4406050001,"3.0","广州金沙洲万达广场","2017.06.30","广东省佛山市",113.203444,23.14682,"南区","广州","夏热冬暖",110558.1,78895," "]
[27,4211000001,"3.0","黄冈黄州万达广场","2018.07.16","湖北省黄冈市",114.90449,30.45989,"南区","武汉","夏热冬冷",101229.9,86639.5," "]
[28,4503030001,"3.0","桂林叠彩万达广场","2017.11.24","广西省桂林市",110.325922,25.321128,"南区","南宁","夏热冬冷",111134.1,91571," "]
[29,4403060001,3.1,"深圳宝安福城万达广场","2020.11.27","广东省深圳市",113.898536,22.57641,"南区","深圳","夏热冬暖",93350.16,59647.71]
{"$rows_left_out":159}
{"sheet":"Sheet1","index":1,"n_rows":370,"n_cols":11,"rows_kept":370,"cut":false,"hidden":false,"merged":[]}
["能源系统项目id","慧云版本","项目名称",null,null,null,"能源平台ID","主数据平台ID","大区","城市公司","广场名称"]
[4304080001,"3.0","衡阳蒸湘万达广场",{"$f":"VLOOKUP(A2,G:K,2,FALSE)","v":1001627},{"$f":"VLOOKUP(A2,G:K,5,FALSE)","v":"衡阳蒸湘万达广场"},{"$f":"IF(C2=E2,1,0)","v":1},2201040002,1001065,"北区",{"$f":"VLOOKUP(H2,[1]sheet1!F$1:I$65536,4,0)","v":{"$error":"#N/A"}},"长春重庆路万达广场"]
[3505240001,"3.0","泉州安溪万达广场",{"$f":"VLOOKUP(A3,G:K,2,FALSE)","v":1001885},{"$f":"VLOOKUP(A3,G:K,5,FALSE)","v":"泉州安溪万达广场"},{"$f":"IF(C3=E3,1,0)","v":1},3601020001,1001064,"南区",{"$f":"VLOOKUP(H3,[1]sheet1!F$1:I$65536,4,0)","v":{"$error":"#N/A"}},"南昌八一万达广场"]
[4309030001,"3.0","益阳赫山万达广场",1001155,"益阳赫山万达广场",1,3702030003,1001066,"东区",{"$f":"VLOOKUP(H4,[1]sheet1!F$1:I$65536,4,0)","v":{"$error":"#N/A"}},"青岛台东万达广场"]
[4508020001,"3.0","贵港港北万达广场",1001846,"贵港港北万达广场",1,4103010001,1000300,"北区",{"$f":"VLOOKUP(H5,[1]sheet1!F$1:I$65536,4,0)","v":{"$error":"#N/A"}},"洛阳涧西万达广场"]
[4505030001,"3.0","北海银海万达广场",1001364,"北海银海万达广场",1,6101121001,1000293,"西区",{"$f":"VLOOKUP(H6,[1]sheet1!F$1:I$65536,4,0)","v":{"$error":"#N/A"}},"西安李家村万达广场"]
[4405110001,"3.0","汕头金平万达广场",1002126,"汕头金平万达广场",1,1101070037,1000265,"北区",{"$f":"VLOOKUP(H7,[1]sheet1!F$1:I$65536,4,0)","v":{"$error":"#N/A"}},"北京石景山万达广场"]
[3601030001,"3.0","南昌西湖万达广场",1001464,"南昌西湖万达广场",1,1201020001,1000275,"北区",{"$f":"VLOOKUP(H8,[1]sheet1!F$1:I$65536,4,0)","v":{"$error":"#N/A"}},"天津河东万达广场"]
[4211820001,"3.0","黄冈武穴万达广场",1002526,"黄冈武穴万达广场",1,5101040001,1000284,"西区",{"$f":"VLOOKUP(H9,[1]sheet1!F$1:I$65536,4,0)","v":{"$error":"#N/A"}},"成都锦华路万达广场"]
[4213030001,"3.0","随州万达广场",1002291,"随州万达广场",1,4101020001,1000287,"北区",{"$f":"VLOOKUP(H10,[1]sheet1!F$1:I$65536,4,0)","v":{"$error":"#N/A"}},"郑州中原万达广场"]
[3610020001,"3.0","抚州临川万达广场",1001151,"抚州临川万达广场",1,6401060001,1000283,"西区",{"$f":"VLOOKUP(H11,[1]sheet1!F$1:I$65536,4,0)","v":{"$error":"#N/A"}},"银川金凤万达广场"]
[3601110001,"3.0","南昌青山湖万达广场",1001838,"南昌青山湖万达广场",1,3205080001,1000296,"东区",{"$f":"VLOOKUP(H12,[1]sheet1!F$1:I$65536,4,0)","v":{"$error":"#N/A"}},"苏州平江万达广场"]
[3505030002,"3.0","泉州城东万达广场",1001841,"泉州城东万达广场",1,3706020002,1001147,"东区",{"$f":"VLOOKUP(H13,[1]sheet1!F$1:I$65536,4,0)","v":{"$error":"#N/A"}},"烟台开发区万达广场"]
[3604020001,"3.0","九江濂溪万达广场",1001504,"九江濂溪万达广场",1,6201020001,1000765,"西区",{"$f":"VLOOKUP(H14,[1]sheet1!F$1:I$65536,4,0)","v":{"$error":"#N/A"}},"兰州城关万达广场"]
[4212020001,"3.0","咸宁咸安万达广场",1002294,"咸宁咸安万达广场",1,6401050001,1000704,"西区",{"$f":"VLOOKUP(H15,[1]sheet1!F$1:I$65536,4,0)","v":{"$error":"#N/A"}},"银川西夏万达广场"]
[4413030001,"3.0","惠州大亚湾万达广场",1001636,"惠州大亚湾万达广场",1,1101060003,1001644,"北区",{"$f":"VLOOKUP(H16,[1]sheet1!F$1:I$65536,4,0)","v":{"$error":"#N/A"}},"北京西铁营万达广场"]
[4407810001,"3.0","江门台山万达广场",1002661,"江门台山万达广场",1,4105000001,1000907,"北区",{"$f":"VLOOKUP(H17,[1]sheet1!F$1:I$65536,4,0)","v":{"$error":"#N/A"}},"安阳文峰万达广场"]
[4501050001,"3.0","南宁江南万达广场",1001405,"南宁江南万达广场",1,1101050001,1001067,"北区",{"$f":"VLOOKUP(H18,[1]sheet1!F$1:I$65536,4,0)","v":{"$error":"#N/A"}},"北京CBD万达广场"]
[4503120003,"3.0","桂林临桂万达广场",1002652,"桂林临桂万达广场",1,3701030002,1000263,"东区",{"$f":"VLOOKUP(H19,[1]sheet1!F$1:I$65536,4,0)","v":{"$error":"#N/A"}},"济南魏家庄万达广场"]
[4401050001,"3.0","广州海珠万达广场",1002506,"广州海珠万达广场",1,1301080001,1000269,"北区",{"$f":"VLOOKUP(H20,[1]sheet1!F$1:I$65536,4,0)","v":{"$error":"#N/A"}},"石家庄裕华万达广场"]
[4401150001,"3.0","广州南沙万达广场",1001015,"广州南沙万达广场",1,3212020001,1000273,"东区",{"$f":"VLOOKUP(H21,[1]sheet1!F$1:I$65536,4,0)","v":{"$error":"#N/A"}},"泰州海陵万达广场"]
[4312020001,"3.0","怀化鹤城万达广场",1002426,"怀化鹤城万达广场",1,2201040001,1000276,"北区",{"$f":"VLOOKUP(H22,[1]sheet1!F$1:I$65536,4,0)","v":{"$error":"#N/A"}},"长春红旗街万达广场"]
[4418020001,"3.0","清远清城万达广场",1001284,"清远清城万达广场",1,3702030001,1000271,"东区",{"$f":"VLOOKUP(H23,[1]sheet1!F$1:I$65536,4,0)","v":{"$error":"#N/A"}},"青岛CBD万达广场"]
[4509020001,"3.0","玉林玉州万达广场",1001837,"玉林玉州万达广场",1,1501010001,1000303,"北区",{"$f":"VLOOKUP(H24,[1]sheet1!F$1:I$65536,4,0)","v":{"$error":"#N/A"}},"呼市赛罕万达广场"]
[4409040001,"3.0","茂名电白万达广场",1002387,"茂名电白万达广场",1,3208020001,1000270,"东区",{"$f":"VLOOKUP(H25,[1]sheet1!F$1:I$65536,4,0)","v":{"$error":"#N/A"}},"淮安水渡口万达广场"]
[4401120003,"3.0","广州南岗万达广场",1002637,"广州南岗万达广场",1,3705020001,1000985,"东区",{"$f":"VLOOKUP(H26,[1]sheet1!F$1:I$65536,4,0)","v":{"$error":"#N/A"}},"东营西城万达广场"]
[4406050001,"3.0","广州金沙洲万达广场",1001425,"广州金沙洲万达广场",1,4206010001,1000281,"南区",{"$f":"VLOOKUP(H27,[1]sheet1!F$1:I$65536,4,0)","v":{"$error":"#N/A"}},"襄阳樊城万达广场"]
[4211000001,"3.0","黄冈黄州万达广场",1001649,"黄冈黄州万达广场",1,4205000001,1000298,"南区",{"$f":"VLOOKUP(H28,[1]sheet1!F$1:I$65536,4,0)","v":{"$error":"#N/A"}},"宜昌伍家岗万达广场"]
[4503030001,"3.0","桂林叠彩万达广场",1001637,"桂林叠彩万达广场",1,3203040001,1000624,"东区",{"$f":"VLOOKUP(H29,[1]sheet1!F$1:I$65536,4,0)","v":{"$error":"#N/A"}},"徐州云龙万达广场"]
[4403060001,3.1,"深圳宝安福城万达广场",1002886,"深圳宝安福城万达广场",1,6501000001,1001119,"西区",{"$f":"VLOOKUP(H30,[1]sheet1!F$1:I$65536,4,0)","v":{"$error":"#N/A"}},"乌鲁木齐经开万达广场"]
{"$rows_left_out":341}
{"sheet":"final","index":2,"n_rows":188,"n_cols":6,"rows_kept":188,"cut":false,"hidden":false,"merged":[]}
["能源系统项目id","Functions_Group",null,"Pj+A列拼起来","慧云版本","项目名称"]
[4304080001,11,1001627,"Pj4304080001","3.0","衡阳蒸湘万达广场"]
[3505240001,11,1001885,"Pj3505240001","3.0","泉州安溪万达广场"]
[4309030001,11,1001155,"Pj4309030001","3.0","益阳赫山万达广场"]
[4508020001,11,1001846,"Pj4508020001","3.0","贵港港北万达广场"]
[4505030001,11,1001364,"Pj4505030001","3.0","北海银海万达广场"]
[4405110001,11,1002126,"Pj4405110001","3.0","汕头金平万达广场"]
[3601030001,11,1001464,"Pj3601030001","3.0","南昌西湖万达广场"]
[4211820001,11,1002526,"Pj4211820001","3.0","黄冈武穴万达广场"]
[4213030001,11,1002291,"Pj4213030001","3.0","随州万达广场"]
[3610020001,11,1001151,"Pj3610020001","3.0","抚州临川万达广场"]
[3601110001,11,1001838,"Pj3601110001","3.0","南昌青山湖万达广场"]
[3505030002,11,1001841,"Pj3505030002","3.0","泉州城东万达广场"]
[3604020001,11,1001504,"Pj3604020001","3.0","九江濂溪万达广场"]
[4212020001,11,1002294,"Pj4212020001","3.0","咸宁咸安万达广场"]
[4413030001,11,1001636,"Pj4413030001","3.0","惠州大亚湾万达广场"]
[4407810001,11,1002661,"Pj4407810001","3.0","江门台山万达广场"]
[4501050001,11,1001405,"Pj4501050001","3.0","南宁江南万达广场"]
[4503120003,11,1002652,"Pj4503120003","3.0","桂林临桂万达广场"]
[4401050001,11,1002506,"Pj4401050001","3.0","广州海珠万达广场"]
[4401150001,11,1001015,"Pj4401150001","3.0","广州南沙万达广场"]
[4312020001,11,1002426,"Pj4312020001","3.0","怀化鹤城万达广场"]
[4418020001,11,1001284,"Pj4418020001","3.0","清远清城万达广场"]
[4509020001,11,1001837,"Pj4509020001","3.0","玉林玉州万达广场"]
[4409040001,11,1002387,"Pj4409040001","3.0","茂名电白万达广场"]
[4401120003,11,1002637,"Pj4401120003","3.0","广州南岗万达广场"]
[4406050001,11,1001425,"Pj4406050001","3.0","广州金沙洲万达广场"]
[4211000001,11,1001649,"Pj4211000001","3.0","黄冈黄州万达广场"]
[4503030001,11,1001637,"Pj4503030001","3.0","桂林叠彩万达广场"]
[4403060001,11,1002886,"Pj4403060001",3.1,"深圳宝安福城万达广场"]
{"$rows_left_out":159}
{"sheet":"东区","index":3,"n_rows":56,"n_cols":15,"rows_kept":56,"cut":false,"hidden":false,"merged":[]}
["序号","能源系统项目id","慧云版本","项目名称","开业时间","所属城市名称","经度","纬度","所属大区","所属","气候分区","总面积","商管公区面积","百货公区面积","停车场面积"]
[1,3301110001,3.1,"杭州富阳万达广场","2021.06.12","浙江省杭州市富阳区",119.933344,30.089688,"东区","杭州"]
[2,3101121003,3.1,"上海马桥万达广场","2020.12.24","上海市","121.379534","31.029057","东区","上海"]
[3,3212810002,"3.0","泰州兴化万达广场","2020.12.18","江苏省泰州市","119.852917","32.905134","东区","南京"]
[4,3413210001,"3.0","宿州砀山万达广场","2020.12.18","安徽省宿州市","116.35764","34.428949","东区","合肥"]
[5,3416020001,"3.0","亳州谯城万达广场","2020.12.12","安徽省亳州市","115.770903","33.879849","东区","合肥"]
[6,3210030005,3.1,"扬州蜀冈万达广场","2020.12.12","江苏省扬州市","119.381559","32.419501","东区","南京"]
[7,3710020001,3.1,"威海环翠万达广场","2020.12.03","山东省威海市","122.145282","37.455772","东区","青岛"]
[8,3302250001,"3.0","宁波象山万达广场","2020.12.03","浙江省宁波市","121.87863","29.460737","东区","宁波"]
[9,3101510001,3.1,"上海崇明万达广场","2020.11.27","上海市","121.424366","31.632266","东区","上海"]
[10,3703030003,"3.0","淄博张店万达广场","2020.07.30","山东省淄博市","118.011673","36.839275","东区","济南"]
[11,3403110001,"3.0","蚌埠淮上万达广场","2020.07.30","安徽省蚌埠市","117.404496","32.975816","东区","合肥"]
[12,3202140001,"3.0","无锡新吴万达广场","2020.07.30","江苏省无锡市","120.37248","31.492869","东区","无锡"]
[13,3206850001,"3.0","南通海安万达广场","2020.06.25","江苏省南通市","120.459845","32.521473","东区","无锡"]
[14,3205830004,"3.0","苏州昆山经开万达广场","2020.06.25","江苏省苏州市","120.981698","31.361593","东区","无锡"]
[15,3101120008,"3.0","上海浦江万达广场","2019.12.31","上海市","121.48","31.40","东区","上海"]
[16,3213220001,"3.0","宿迁沭阳万达广场","2019.12.28","江苏省宿迁市","118.24","33.96","东区","南京"]
[17,3704030002,"3.0","枣庄滕州万达广场","2019.12.21","山东省枣庄市","117.201893","35.11605","东区","济南"]
[18,3401210001,"3.0","合肥北城万达广场","2019.12.31","安徽省合肥市","117.26","31.97","东区","合肥"]
[19,3711020002,"3.0","日照东港万达广场","2019.12.12","山东省日照市","119.556523","35.437346","东区","青岛"]
[20,3208120003,"3.0","淮安楚州万达广场","2019.12.21","江苏省淮安市","119.14","33.50","东区","南京"]
[21,3413020002,"3.0","宿州CBD万达广场","2019.11.22","安徽省宿州市","116.97","33.63","东区","合肥"]
[22,3702140002,"3.0","青岛城阳万达广场","2019.11.08","山东省青岛市","120.428489","36.312244","东区","青岛"]
[23,3715020001,"3.0","聊城万达广场","2019.10.19","山东省聊城市","115.987747","36.479641","东区","济南"]
[24,3713020002,"3.0","临沂上海路万达广场","2019.09.28","山东省临沂市","118.361282","35.113647","东区","济南"]
[25,3411030001,"3.0","滁州南谯万达广场","2019.08.24","安徽省滁州市","118.326866","32.289246","东区","合肥"]
[26,3301100001,"3.0","杭州余杭万达广场","2019.08.09","浙江省杭州市","120.3","30.42","东区","杭州"]
[27,3707830001,"3.0","潍坊寿光万达广场","2018.12.29","山东省潍坊市","119.135766","36.723623","东区","青岛"]
[28,3205820003,"3.0","苏州张家港万达广场","2018.12.28","江苏省苏州市","120.467255","31.953041","东区","无锡"]
[29,3213110001,"3.0","宿迁宿豫万达广场","2018.12.07","江苏省宿迁市","118.32608","33.9474","东区","南京"]
{"$rows_left_out":27}
{"sheet":"西区","index":4,"n_rows":45,"n_cols":15,"rows_kept":45,"cut":false,"hidden":false,"merged":[]}
["序号","能源系统项目id","慧云版本","项目名称","开业时间","所属城市名称","经度","纬度","所属大区","所属","气候分区","总面积","商管公区面积","百货公区面积","停车场面积"]
[1,5134010001,"3.0","凉山州西昌万达广场","2020.12.24","四川省凉山彝族自治州","102.284313","27.874424","西区","成都"]
[2,6501040002,"3.0","乌鲁木齐德港万达广场","2020.12.18","新疆省乌鲁木齐市","87.539389","43.883499","西区","乌鲁木齐"]
[3,5201030002,"3.0","贵阳数博万达广场","2020.12.18","贵州省贵阳市","106.65639","26.599841","西区","昆明"]
[4,5101130001,3.1,"成都青白江万达广场","2020.12.11","四川省成都市","104.262802","30.898045","西区","成都"]
[5,5103040001,3.1,"自贡汇川路万达广场","2020.12.03","四川省自贡市","104.757099","29.335795","西区","成都"]
[6,5301140003,"3.0","昆明呈贡万达广场","2020.11.27","云南省昆明市","102.834865","24.877499","西区","昆明"]
[7,6109020001,"3.0","安康高新万达广场","2020.11.20","陕西省安康市","108.984945","32.712033","西区","西安"]
[8,5401020001,"3.0","拉萨城关万达广场","2020.08.08","西藏自治区拉萨市","91.188536","29.662751","西区","成都"]
[9,5104020001,"3.0","攀枝花万达广场","2019.12.31","四川省攀枝花市","101.735072","26.570183","西区","成都"]
[10,5201030001,"3.0","贵阳云岩万达广场","2019.12.29","贵州省贵阳市","106.62","26.67","西区","昆明"]
[11,5001190001,"3.0","重庆南川万达广场","2019.12.28","重庆市南川区","107.098359","29.164448","西区","重庆"]
[12,5001020001,"3.0","重庆涪陵万达广场","2019.07.19","重庆市涪陵区","107.415199","29.70019","西区","重庆"]
[13,6110020001,"3.0","商洛万达广场","2019.06.22","陕西省商洛市","109.94107","33.86273","西区","西安"]
[14,5001040001,"3.0","重庆大渡口万达广场","2019.06.21","重庆市大渡口区","106.477097","29.450239","西区","重庆"]
[15,5227010001,"3.0","黔南都匀万达广场","2019.01.25","贵州省黔南布依族苗族自治州","107.52","26.30","西区","昆明"]
[16,6108020001,"3.0","榆林榆阳万达广场","2018.12.22","陕西省榆林市","109.29315","37.95871","西区","西安"]
[17,5001060001,"3.0","重庆沙坪坝万达广场","2018.11.30","重庆市沙坪坝区","105.935893","29.342205","西区","重庆"]
[18,5101120002,"3.0","成都龙泉驿万达广场","2018.10.26","四川省成都市","104.265259","30.558901","西区","成都"]
[19,6206020001,"3.0","武威凉州万达广场","2018.10.19","甘肃省威武市","102.662659","37.515919","西区","兰州"]
[20,6501040001,"3.0","乌鲁木齐高新万达广场","2018.09.21","新疆省乌鲁木齐市","88.31104","43.36378","西区","乌鲁木齐"]
[21,5105000001,"3.0","泸州龙马潭万达广场","2018.07.01","四川省泸州市","105.426825","28.917006","西区","成都"]
[22,6501030001,"3.0","乌鲁木齐德汇万达广场","2019.11.23","新疆省乌鲁木齐市","87.593691","43.79542","西区","乌鲁木齐"]
[23,5101210001,"3.0","成都金堂万达广场","2017.12.08","四川省成都市","104.42307","30.85929","西区","成都"]
[24,5202010001,"3.0","六盘水钟山万达广场","2017.12.08","贵州省六盘水市","104.865445","26.581817","西区","昆明"]
[25,6101130001,"3.0","西安高新万达广场","2017.11.18","陕西省西安市","108.897025","34.21635","西区","西安"]
[26,6209020001,"3.0","酒泉肃州万达广场","2017.11.10","甘肃省酒泉市","98.493076","39.73926","西区","兰州"]
[27,5303020001,"3.0","曲靖麒麟万达广场","2017.10.27","云南省昆明市","103.76441","25.526946","西区","昆明"]
[28,5101840001,"3.0","成都崇州万达广场","2017.09.01","四川省成都市","103.692312","30.628923","西区","成都"]
[29,5001090001,"3.0","重庆北碚万达广场","2017.08.25","重庆市北碚区","106.39669","29.803424","西区","重庆"]
{"$rows_left_out":16}
{"sheet":"南区","index":5,"n_rows":37,"n_cols":15,"rows_kept":37,"cut":false,"hidden":false,"merged":[]}
["序号","能源系统项目id","慧云版本","项目名称","开业时间","所属城市名称","经度","纬度","所属大区","所属","气候分区","总面积","商管公区面积","百货公区面积","停车场面积"]
[1,4304080001,"3.0","衡阳蒸湘万达广场","2017.09.29","湖南省衡阳市",112.597894,26.88864,"南区","长沙","夏热冬冷",120149.1,91131," "]
[2,3505240001,"3.0","泉州安溪万达广场","2019.02.27","福建省泉州市",118.229196,25.076059,"南区","厦门","夏热冬暖",142011.4,74787.1," "]
[3,4309030001,"3.0","益阳赫山万达广场","2017.06.23","湖南省长沙市",112.379614,28.571233,"南区","长沙","夏热冬冷",131313.5,83046," "]
[4,4508020001,"3.0","贵港港北万达广场","2018.12.29","广西省南宁市",108.298197,22.874262,"南区","南宁","夏热冬暖",104069.3,81012.9," "]
[5,4505030001,"3.0","北海银海万达广场","2017.05.27","广西省北海市",109.150329,21.437483,"南区","南宁","夏热冬暖",108067.3,90513," "]
[6,4405110001,"3.0","汕头金平万达广场","2019.05.25","广东省汕头市",116.652573,23.384642,"南区","深圳","夏热冬暖",142071.7,98900," "]
[7,3601030001,"3.0","南昌西湖万达广场","2017.06.23","江西省南昌市",115.864326,28.638564,"南区","南昌","夏热冬冷",139907.3,100915," "]
[8,4211820001,"3.0","黄冈武穴万达广场","2019.12.31","湖北省黄冈市",115.58,29.85,"南区","武汉","夏热冬冷",104910.6,89500," "]
[9,4213030001,"3.0","随州万达广场","2019.11.15","湖北省随州市",113.41,31.69,"南区","武汉","夏热冬冷",124906.4,80210.4," "]
[10,3610020001,"3.0","抚州临川万达广场","2017.06.16","江西省抚州市",116.353068,27.962745,"南区","南昌","夏热冬冷",140154.5,90614," "]
[11,3601110001,"3.0","南昌青山湖万达广场","2018.12.21","江西省南昌市",115.96191,28.68194,"南区","南昌","夏热冬冷",118060,92700," "]
[12,3505030002,"3.0","泉州城东万达广场","2018.12.22","福建省泉州市",118.605866,24.888244,"南区","厦门","夏热冬暖",156940.4,89500," "]
[13,3604020001,"3.0","九江濂溪万达广场","2017.07.08","江西省九江市",116.021154,29.698556,"南区","南昌","夏热冬冷",130110.2,80052," "]
[14,4212020001,"3.0","咸宁咸安万达广场","2019.11.29","湖北省咸宁市",114.3,29.87,"南区","武汉","夏热冬冷",103766.9,85344," "]
[15,4413030001,"3.0","惠州大亚湾万达广场","2017.11.24","广东省惠州市",114.486968,22.761301,"南区","深圳","夏热冬暖",138700,99627," "]
[16,4407810001,"3.0","江门台山万达广场","2020.08.29","广东省江门市",112.820909,22.234528,"南区","广州","夏热冬暖",114254.9,79924.75," "]
[17,4501050001,"3.0","南宁江南万达广场","2017.06.23","广西省南宁市",108.319568,22.795787,"南区","南宁","夏热冬暖",135834.6,92677," "]
[18,4503120003,"3.0","桂林临桂万达广场","2020.09.30","广西省桂林市",110.196098,25.230569,"南区","南宁","夏热冬冷",129220.2,120218.1," "]
[19,4401050001,"3.0","广州海珠万达广场","2019.12.28","广东省广州市",113.32,23.08,"南区","广州","夏热冬暖",133841.7,68600," "]
[20,4401150001,"3.0","广州南沙万达广场","2015.12.22","广东省广州市",113.538907,22.801003,"南区","广州","夏热冬暖",164062,57600,20000]
[21,4312020001,"3.0","怀化鹤城万达广场","2019.12.21","湖南省怀化市",109.95,27.33,"南区","长沙","夏热冬冷",142081.4,81800," "]
[22,4418020001,"3.0","清远清城万达广场","2016.12.29","广东省清远市",113.019665,23.71962,"南区","广州","夏热冬暖",126600,91552," "]
[23,4509020001,"3.0","玉林玉州万达广场","2019.05.25","广西省玉林市",110.17923,22.635788,"南区","南宁","夏热冬暖",110949.1,92090," "]
[24,4409040001,"3.0","茂名电白万达广场","2019.12.19","广东省茂名市",110.88,21.68,"南区","广州","夏热冬暖",134442.7,79836," "]
[25,4401120003,"3.0","广州南岗万达广场","2020.09.30","广东省广州市",113.556991,23.10529,"南区","广州","夏热冬暖",135700,84163.22," "]
[26,4406050001,"3.0","广州金沙洲万达广场","2017.06.30","广东省佛山市",113.203444,23.14682,"南区","广州","夏热冬暖",110558.1,78895," "]
[27,4211000001,"3.0","黄冈黄州万达广场","2018.07.16","湖北省黄冈市",114.90449,30.45989,"南区","武汉","夏热冬冷",101229.9,86639.5," "]
[28,4503030001,"3.0","桂林叠彩万达广场","2017.11.24","广西省桂林市",110.325922,25.321128,"南区","南宁","夏热冬冷",111134.1,91571," "]
[29,4403060001,3.1,"深圳宝安福城万达广场","2020.11.27","广东省深圳市",113.898536,22.57641,"南区","深圳","夏热冬暖",93350.16,59647.71]
{"$rows_left_out":8}
{"sheet":"北区","index":6,"n_rows":53,"n_cols":15,"rows_kept":53,"cut":false,"hidden":false,"merged":[]}
["序号","能源系统项目id","慧云版本","项目名称","开业时间","所属城市名称","经度","纬度","所属大区","所属","气候分区","总面积","商管公区面积","百货公区面积","停车场面积"]
[1,1201140001,3.1,"天津武清福源万达广场","2020.11.27","天津市","117.064992","39.411958","北区","天津"]
[2,1509020001,"3.0","乌兰察布万达广场","2020.12.23","内蒙古自治区乌兰察布市","113.158968","40.999532","北区","呼和浩特"]
[3,4114020001,3.1,"商丘港汇万达广场","2020.11.27","河南省商丘市","115.645774","34.447411","北区","郑州"]
[4,4116020001,3.1,"周口开元万达广场","2020.12.03","河南省周口市","114.656253","33.589134","北区","郑州"]
[5,1304020001,3.1,"邯郸邯山万达广场","2020.11.28","河北省邯郸市","114.512095","36.602678","北区","北京"]
[6,1306820001,3.1,"保定定州万达广场","2020.11.11","河北省保定市","115.016543","38.533666","北区","北京"]
[7,4101010001,"3.0","郑州高新万达广场","2020.09.30","河南省郑州市","113.587911","34.814652","北区","郑州"]
[8,2101120002,"3.0","沈阳全运万达广场","2019.12.20","吉林省沈阳市","123.46","41.69","北区","沈阳"]
[9,1306060002,"3.0","保定未来石万达广场","2019.12.31","河北省保定市","115.564722","38.885238","北区","北京"]
[10,2205020001,"3.0","通化万达广场","2019.12.20","吉林省通化市","125.94","41.70","北区","长春"]
[11,4109020002,"3.0","濮阳经开万达广场","2019.12.20","河南省濮阳市","115.033177","35.795596","北区","郑州"]
[12,1306060001,"3.0","保定嘉德万达广场","2019.12.19","河北省保定市","115.517479","38.852588","北区","北京"]
[13,1406020001,"3.0","朔州朔城万达广场","2019.11.29","山西省朔州市","112.40","39.32","北区","太原"]
[14,1303020001,"3.0","秦皇岛海港万达广场","2019.11.22","河北省秦皇岛市","119.583396","39.956449","北区","天津"]
[15,1411810001,"3.0","吕梁孝义万达广场","2019.11.22","山西省吕梁市","111.78861","37.144086","北区","太原"]
[16,1506020001,"3.0","鄂尔多斯万达广场","2019.09.30","内蒙古自治区鄂尔多斯市","109.982391","39.820324","北区","呼和浩特"]
[17,1522010001,"3.0","兴安盟万达广场","2019.09.13","内蒙古自治区兴安盟乌兰浩特市","122.03414","46.093253","北区","呼和浩特"]
[18,2103040001,"3.0","鞍山高新万达广场","2019.08.10","辽宁省鞍山市","123.058174","41.109325","北区","沈阳"]
[19,2306040001,"3.0","大庆让胡路万达广场","2019.07.19","黑龙江省大庆市","125.088287","46.594418","北区","哈尔滨"]
[20,1301020001,"3.0","石家庄长安万达广场","2019.06.28","河北省石家庄市","114.539062","38.036655","北区","天津"]
[21,2105020001,"3.0","本溪万达广场","2018.12.21","辽宁省本溪市","123.787123","41.295121","北区","沈阳"]
[22,4110020001,"3.0","许昌魏都万达广场","2018.10.26","河南省许昌市","113.872131","33.999249","北区","郑州"]
[23,1305020001,"3.0","邢台襄都万达广场","2018.11.02","河北省邢台市","114.494629","37.070339","北区","天津"]
[24,2312020001,"3.0","绥化万达广场","2018.09.30","黑龙江省绥化市","125.10125","46.600313","北区","哈尔滨"]
[25,4102020001,"3.0","开封龙亭万达广场","2018.09.28","河南省开封市","114.30294","34.75647","北区","郑州"]
[26,1502070001,"3.0","包头九原万达广场","2018.08.20","内蒙古自治区包头市","109.95253","40.606232","北区","呼和浩特"]
[27,2109110001,"3.0","阜新万达广场","2018.08.10","辽宁省阜新市","121.646729","42.034229","北区","沈阳"]
[28,4114030001,"3.0","商丘睢阳万达广场","2018.07.06","河南省商丘市","115.640541","34.42078","北区","郑州"]
[29,4106220001,"3.0","鹤壁淇滨万达广场","2018.06.01","河南省鹤壁市","114.299377","35.717129","北区","郑州"]
{"$rows_left_out":23}